Reaction Details
TargetEctonucleotide pyrophosphatase/phosphodiesterase family member 1
LigandBDBM50031882
Substrate/Competitorn/a
Meas. Tech.ChEMBL_1437890 (CHEMBL3384854)
Ki 217±n/a nM
Citation Chang, LLee, SYLeonczak, PRozenski, JDe Jonghe, SHanck, TMüller, CEHerdewijn, P Imidazopyridine- and purine-thioacetamide derivatives: potent inhibitors of nucleotide pyrophosphatase/phosphodiesterase 1 (NPP1). J Med Chem57:10080-100 (2014) 
 
Ectonucleotide pyrophosphatase/phosphodiesterase family member 1
Name:Ectonucleotide pyrophosphatase/phosphodiesterase family member 1
Type:PROTEIN
Mol. Mass.:104934.43
Organism:Homo sapiens (Human)
Description:ChEMBL_1448940
Residue:925
BDBM50031882
NameBDBM50031882
Synonyms:CHEMBL1433061
TypeSmall organic molecule
Emp. Form.C16H16N4O3S
Mol. Mass.344.388
SMILESCOc1ccc(NC(=O)CSc2nc3ccc[nH]c3n2)cc1OC