Reaction Details
TargetEctonucleotide pyrophosphatase/phosphodiesterase family member 1
LigandBDBM50031820
Substrate/Competitorn/a
Meas. Tech.ChEMBL_1437891 (CHEMBL3384855)
Ki 78000±n/a nM
Citation Chang, LLee, SYLeonczak, PRozenski, JDe Jonghe, SHanck, TMüller, CEHerdewijn, P Imidazopyridine- and purine-thioacetamide derivatives: potent inhibitors of nucleotide pyrophosphatase/phosphodiesterase 1 (NPP1). J Med Chem57:10080-100 (2014) 
 
Ectonucleotide pyrophosphatase/phosphodiesterase family member 1
Name:Ectonucleotide pyrophosphatase/phosphodiesterase family member 1
Type:PROTEIN
Mol. Mass.:104934.43
Organism:Homo sapiens (Human)
Description:ChEMBL_1448940
Residue:925
BDBM50031820
NameBDBM50031820
Synonyms:CHEMBL3360897
TypeSmall organic molecule
Emp. Form.C15H17N7O3S
Mol. Mass.375.406
SMILESCOc1ccc(NC(=O)CSc2nc3c(N)nc(N)nc3[nH]2)cc1OC