Reaction Details
TargetCathepsin B
LigandBDBM50157741
Substrate/Competitorn/a
Meas. Tech.ChEMBL_1438636 (CHEMBL3387327)
IC50 40±n/a nM
Citation Burger, MCFernandes, JBda Silva, MFEscalante, APrudhomme, JLe Roch, KGIzidoro, MAVieira, PC Structures and bioactivities of dihydrochalcones from Metrodorea stipularis. J Nat Prod77:2418-22 (2014) 
 
Cathepsin B
Name:Cathepsin B
Type:Enzyme
Mol. Mass.:37819.69
Organism:Homo sapiens (Human)
Description:gi_63102437
Residue:339
BDBM50157741
NameBDBM50157741
Synonyms:CHEMBL374508 E64
TypeSmall organic molecule
Emp. Form.C15H27N5O5
Mol. Mass.357.4054
SMILES[#6]-[#6](-[#6])-[#6]-[#6@H](-[#7]-[#6](=O)-[#6@H]-1-[#8]-[#6@@H]-1-[#6](-[#8])=O)-[#6](=O)-[#7]-[#6]-[#6]-[#6]-[#6]\[#7]=[#6](/[#7])-[#7]