Reaction Details
TargetATP-dependent translocase ABCB1
LigandBDBM50032251
Substrate/Competitorn/a
Meas. Tech.ChEMBL_1439392 (CHEMBL3389757)
EC50 930±n/a nM
Citation Capparelli, EZinzi, LCantore, MContino, MPerrone, MGLuurtsema, GBerardi, FPerrone, RColabufo, NA SAR studies on tetrahydroisoquinoline derivatives: the role of flexibility and bioisosterism to raise potency and selectivity toward P-glycoprotein. J Med Chem57:9983-94 (2014) 
 
ATP-dependent translocase ABCB1
Name:ATP-dependent translocase ABCB1
Type:Protein
Mol. Mass.:141503.50
Organism:Homo sapiens (Human)
Description:P08183
Residue:1280
BDBM50032251
NameBDBM50032251
Synonyms:CHEMBL3352983
TypeSmall organic molecule
Emp. Form.C26H29NO4
Mol. Mass.419.5128
SMILESCOc1ccc(cc1)-c1ccc(OCCN2CCc3cc(OC)c(OC)cc3C2)cc1