Reaction Details
TargetATP-dependent translocase ABCB1
LigandBDBM50032257
Substrate/Competitorn/a
Meas. Tech.ChEMBL_1439392 (CHEMBL3389757)
EC50 8100±n/a nM
Citation Capparelli, EZinzi, LCantore, MContino, MPerrone, MGLuurtsema, GBerardi, FPerrone, RColabufo, NA SAR studies on tetrahydroisoquinoline derivatives: the role of flexibility and bioisosterism to raise potency and selectivity toward P-glycoprotein. J Med Chem57:9983-94 (2014) 
 
ATP-dependent translocase ABCB1
Name:ATP-dependent translocase ABCB1
Type:Protein
Mol. Mass.:141503.50
Organism:Homo sapiens (Human)
Description:P08183
Residue:1280
BDBM50032257
NameBDBM50032257
Synonyms:CHEMBL3352977
TypeSmall organic molecule
Emp. Form.C22H23NO4
Mol. Mass.365.4223
SMILESCOc1cc2CCN(Cc3ccc(o3)-c3ccc(O)cc3)Cc2cc1OC