Reaction Details
TargetMultidrug resistance-associated protein 1
LigandBDBM50374731
Substrate/Competitorn/a
Meas. Tech.ChEMBL_1439393 (CHEMBL3389758)
EC50 2800±n/a nM
Citation Capparelli, EZinzi, LCantore, MContino, MPerrone, MGLuurtsema, GBerardi, FPerrone, RColabufo, NA SAR studies on tetrahydroisoquinoline derivatives: the role of flexibility and bioisosterism to raise potency and selectivity toward P-glycoprotein. J Med Chem57:9983-94 (2014) 
 
Multidrug resistance-associated protein 1
Name:Multidrug resistance-associated protein 1
Type:n/a
Mol. Mass.:171597.72
Organism:Homo sapiens (Human)
Description:P33527
Residue:1531
BDBM50374731
NameBDBM50374731
Synonyms:CHEMBL260599
TypeSmall organic molecule
Emp. Form.C25H31NO3
Mol. Mass.393.5185
SMILESCOc1cc2CCN(CC\C=C3/CCCc4c(OC)cccc34)Cc2cc1OC