Reaction Details
TargetATP-dependent translocase ABCB1
LigandBDBM50032263
Substrate/Competitorn/a
Meas. Tech.ChEMBL_1439392 (CHEMBL3389757)
EC50 5800±n/a nM
Citation Capparelli, EZinzi, LCantore, MContino, MPerrone, MGLuurtsema, GBerardi, FPerrone, RColabufo, NA SAR studies on tetrahydroisoquinoline derivatives: the role of flexibility and bioisosterism to raise potency and selectivity toward P-glycoprotein. J Med Chem57:9983-94 (2014) 
 
ATP-dependent translocase ABCB1
Name:ATP-dependent translocase ABCB1
Type:Protein
Mol. Mass.:141503.50
Organism:Homo sapiens (Human)
Description:P08183
Residue:1280
BDBM50032263
NameBDBM50032263
Synonyms:CHEMBL3352973
TypeSmall organic molecule
Emp. Form.C29H29NO5
Mol. Mass.471.5443
SMILESCOc1ccc(cc1)-c1ccc2OCC(CC(=O)N3CCc4cc(OC)c(OC)cc4C3)=Cc2c1