Reaction Details
TargetATP-dependent translocase ABCB1
LigandBDBM50429195
Substrate/Competitorn/a
Meas. Tech.ChEMBL_1439392 (CHEMBL3389757)
EC50 9300±n/a nM
Citation Capparelli, EZinzi, LCantore, MContino, MPerrone, MGLuurtsema, GBerardi, FPerrone, RColabufo, NA SAR studies on tetrahydroisoquinoline derivatives: the role of flexibility and bioisosterism to raise potency and selectivity toward P-glycoprotein. J Med Chem57:9983-94 (2014) 
 
ATP-dependent translocase ABCB1
Name:ATP-dependent translocase ABCB1
Type:Protein
Mol. Mass.:141503.50
Organism:Homo sapiens (Human)
Description:P08183
Residue:1280
BDBM50429195
NameBDBM50429195
Synonyms:CHEMBL260505
TypeSmall organic molecule
Emp. Form.C24H25NO3
Mol. Mass.375.4602
SMILESCOc1cc2CCN(Cc3ccc(cc3)-c3ccc(O)cc3)Cc2cc1OC