Reaction Details
TargetNeutrophil elastase
LigandBDBM50032887
Substrate/Competitorn/a
Meas. Tech.ChEMBL_1431796 (CHEMBL3385092)
EC50 3.0±n/a nM
Citation Abdel-Magid, AF Neutrophil elastase inhibitors as potential anti-inflammatory therapies. ACS Med Chem Lett5:1182-3 (2014) 
 
Neutrophil elastase
Name:Neutrophil elastase
Type:Enzyme
Mol. Mass.:28532.38
Organism:Homo sapiens (Human)
Description:P08246
Residue:267
BDBM50032887
NameBDBM50032887
Synonyms:CHEMBL3342777 US9670166, 2
TypeSmall organic molecule
Emp. Form.C22H16F3N3O2
Mol. Mass.411.3765
SMILESCN1C(C2=C(CCC2=O)N(C1=O)c1cccc(c1)C(F)(F)F)c1ccc(cc1)C#N