Reaction Details
TargetNeutrophil elastase
LigandBDBM50032890
Substrate/Competitorn/a
Meas. Tech.ChEMBL_1431796 (CHEMBL3385092)
EC50<1.000000±n/a nM
Citation Abdel-Magid, AF Neutrophil elastase inhibitors as potential anti-inflammatory therapies. ACS Med Chem Lett5:1182-3 (2014) 
 
Neutrophil elastase
Name:Neutrophil elastase
Type:Enzyme
Mol. Mass.:28532.38
Organism:Homo sapiens (Human)
Description:P08246
Residue:267
BDBM50032890
NameBDBM50032890
Synonyms:CHEMBL3342780
TypeSmall organic molecule
Emp. Form.C25H20F2N4O5S
Mol. Mass.526.512
SMILESCS(=O)(=O)c1cc(ccc1C1N(C(=O)N2CC2)C(=O)N(C2=C1C(=O)CC2)c1cccc(c1)C(F)F)C#N