Reaction Details
TargetToll-like receptor 9
LigandBDBM50033103
Substrate/Competitorn/a
Meas. Tech.ChEMBL_1433562 (CHEMBL3383964)
IC50 28±n/a nM
Citation Watanabe, MKasai, MTomizawa, HAoki, MEiho, KIsobe, YAsano, S Dihydropyrrolo[2,3-d]pyrimidines: Selective Toll-Like Receptor 9 Antagonists from Scaffold Morphing Efforts. ACS Med Chem Lett5:1235-9 (2014) 
 
Toll-like receptor 9
Name:Toll-like receptor 9
Type:Enzyme
Mol. Mass.:115889.91
Organism:Homo sapiens (Human)
Description:Q9NR96
Residue:1032
BDBM50033103
NameBDBM50033103
Synonyms:CHEMBL3357069
TypeSmall organic molecule
Emp. Form.C26H38N6O2
Mol. Mass.466.6189
SMILESCOCCN1CCN(CC1)c1ccc(cc1)-c1ncc2CCN(CCCN3CCOCC3)c2n1