Reaction Details
TargetToll-like receptor 9
LigandBDBM50033106
Substrate/Competitorn/a
Meas. Tech.ChEMBL_1433562 (CHEMBL3383964)
IC50 56±n/a nM
Citation Watanabe, MKasai, MTomizawa, HAoki, MEiho, KIsobe, YAsano, S Dihydropyrrolo[2,3-d]pyrimidines: Selective Toll-Like Receptor 9 Antagonists from Scaffold Morphing Efforts. ACS Med Chem Lett5:1235-9 (2014) 
 
Toll-like receptor 9
Name:Toll-like receptor 9
Type:Enzyme
Mol. Mass.:115889.91
Organism:Homo sapiens (Human)
Description:Q9NR96
Residue:1032
BDBM50033106
NameBDBM50033106
Synonyms:CHEMBL3357066
TypeSmall organic molecule
Emp. Form.C24H34N6O
Mol. Mass.422.5664
SMILESCN1CCN(CC1)c1cccc(c1)-c1ncc2CCN(CCCN3CCOCC3)c2n1