Reaction Details
TargetA disintegrin and metalloproteinase with thrombospondin motifs 4
LigandBDBM50033860
Substrate/Competitorn/a
Meas. Tech.ChEMBL_1435758 (CHEMBL3388950)
IC50 110±n/a nM
Citation Durham, TBKlimkowski, VJRito, CJMarimuthu, JToth, JLLiu, CDurbin, JDStout, SLAdams, LSwearingen, CLin, CChambers, MGThirunavukkarasu, KWiley, MR Identification of potent and selective hydantoin inhibitors of aggrecanase-1 and aggrecanase-2 that are efficacious in both chemical and surgical models of osteoarthritis. J Med Chem57:10476-85 (2014) 
 
A disintegrin and metalloproteinase with thrombospondin motifs 4
Name:A disintegrin and metalloproteinase with thrombospondin motifs 4
Type:Enzyme
Mol. Mass.:90214.54
Organism:Homo sapiens (Human)
Description:O75173
Residue:837
BDBM50033860
NameBDBM50033860
Synonyms:CHEMBL3358152
TypeSmall organic molecule
Emp. Form.C14H12ClN3O4
Mol. Mass.321.716
SMILESC[C@]1(CNC(=O)c2cc3cc(Cl)ccc3o2)NC(=O)NC1=O