Reaction Details
TargetA disintegrin and metalloproteinase with thrombospondin motifs 5
LigandBDBM50033808
Substrate/Competitorn/a
Meas. Tech.ChEMBL_1435759 (CHEMBL3388951)
IC50 4.0±n/a nM
Citation Durham, TBKlimkowski, VJRito, CJMarimuthu, JToth, JLLiu, CDurbin, JDStout, SLAdams, LSwearingen, CLin, CChambers, MGThirunavukkarasu, KWiley, MR Identification of potent and selective hydantoin inhibitors of aggrecanase-1 and aggrecanase-2 that are efficacious in both chemical and surgical models of osteoarthritis. J Med Chem57:10476-85 (2014) 
 
A disintegrin and metalloproteinase with thrombospondin motifs 5
Name:A disintegrin and metalloproteinase with thrombospondin motifs 5
Type:Enzyme
Mol. Mass.:101769.09
Organism:Homo sapiens (Human)
Description:Q9UNA0
Residue:930
BDBM50033808
NameBDBM50033808
Synonyms:CHEMBL3358158
TypeSmall organic molecule
Emp. Form.C18H14F3N5O4
Mol. Mass.421.3301
SMILESCn1ccnc1[C@]1(CNC(=O)c2cc3cc(ccc3o2)C(F)(F)F)NC(=O)NC1=O