Reaction Details
TargetStromelysin-1
LigandBDBM50033808
Substrate/Competitorn/a
Meas. Tech.ChEMBL_1435762 (CHEMBL3388954)
IC50 69000±n/a nM
Citation Durham, TBKlimkowski, VJRito, CJMarimuthu, JToth, JLLiu, CDurbin, JDStout, SLAdams, LSwearingen, CLin, CChambers, MGThirunavukkarasu, KWiley, MR Identification of potent and selective hydantoin inhibitors of aggrecanase-1 and aggrecanase-2 that are efficacious in both chemical and surgical models of osteoarthritis. J Med Chem57:10476-85 (2014) 
 
Stromelysin-1
Name:Stromelysin-1
Type:Enzyme
Mol. Mass.:53973.13
Organism:Homo sapiens (Human)
Description: P08254
Residue:477
BDBM50033808
NameBDBM50033808
Synonyms:CHEMBL3358158
TypeSmall organic molecule
Emp. Form.C18H14F3N5O4
Mol. Mass.421.3301
SMILESCn1ccnc1[C@]1(CNC(=O)c2cc3cc(ccc3o2)C(F)(F)F)NC(=O)NC1=O