Reaction Details
TargetPotassium voltage-gated channel subfamily H member 2
LigandBDBM50034089
Substrate/Competitorn/a
Meas. Tech.ChEMBL_1437210 (CHEMBL3382984)
IC50 1400±n/a nM
Citation Lan, YChen, YCao, XZhang, JWang, JXu, XQiu, YZhang, TLiu, XLiu, BFZhang, G Synthesis and biological evaluation of novel sigma-1 receptor antagonists based on pyrimidine scaffold as agents for treating neuropathic pain. J Med Chem57:10404-23 (2014) 
 
Potassium voltage-gated channel subfamily H member 2
Name:Potassium voltage-gated channel subfamily H member 2
Type:Multi-pass membrane protein
Mol. Mass.:126672.65
Organism:Homo sapiens (Human)
Description:Q12809
Residue:1159
BDBM50034089
NameBDBM50034089
Synonyms:CHEMBL3359238
TypeSmall organic molecule
Emp. Form.C19H22ClF2N3O
Mol. Mass.381.847
SMILESCc1nc(nc(OCCCN2CCCCC2)c1Cl)-c1ccc(F)c(F)c1