Reaction Details
TargetSigma non-opioid intracellular receptor 1
LigandBDBM50034090
Substrate/Competitorn/a
Meas. Tech.ChEMBL_1437207 (CHEMBL3382981)
Ki 1.1±n/a nM
Citation Lan, YChen, YCao, XZhang, JWang, JXu, XQiu, YZhang, TLiu, XLiu, BFZhang, G Synthesis and biological evaluation of novel sigma-1 receptor antagonists based on pyrimidine scaffold as agents for treating neuropathic pain. J Med Chem57:10404-23 (2014) 
 
Sigma non-opioid intracellular receptor 1
Name:Sigma non-opioid intracellular receptor 1
Type:Protein
Mol. Mass.:25307.17
Organism:Cavia porcellus (Guinea pig)
Description:Q60492
Residue:223
BDBM50034090
NameBDBM50034090
Synonyms:CHEMBL3359239
TypeSmall organic molecule
Emp. Form.C19H23Cl2N3O
Mol. Mass.380.311
SMILESCc1nc(nc(OCCCN2CCCCC2)c1Cl)-c1ccc(Cl)cc1