Reaction Details
TargetSigma non-opioid intracellular receptor 1
LigandBDBM50034086
Substrate/Competitorn/a
Meas. Tech.ChEMBL_1437207 (CHEMBL3382981)
Ki 2.0±n/a nM
Citation Lan, YChen, YCao, XZhang, JWang, JXu, XQiu, YZhang, TLiu, XLiu, BFZhang, G Synthesis and biological evaluation of novel sigma-1 receptor antagonists based on pyrimidine scaffold as agents for treating neuropathic pain. J Med Chem57:10404-23 (2014) 
 
Sigma non-opioid intracellular receptor 1
Name:Sigma non-opioid intracellular receptor 1
Type:Protein
Mol. Mass.:25307.17
Organism:Cavia porcellus (Guinea pig)
Description:Q60492
Residue:223
BDBM50034086
NameBDBM50034086
Synonyms:CHEMBL3359234
TypeSmall organic molecule
Emp. Form.C20H26ClN3O
Mol. Mass.359.893
SMILESCc1ccc(cc1)-c1nc(C)c(Cl)c(OCCCN2CCCCC2)n1