Reaction Details
TargetSigma non-opioid intracellular receptor 1
LigandBDBM50034186
Substrate/Competitorn/a
Meas. Tech.ChEMBL_1437207 (CHEMBL3382981)
Ki 3.8±n/a nM
Citation Lan, YChen, YCao, XZhang, JWang, JXu, XQiu, YZhang, TLiu, XLiu, BFZhang, G Synthesis and biological evaluation of novel sigma-1 receptor antagonists based on pyrimidine scaffold as agents for treating neuropathic pain. J Med Chem57:10404-23 (2014) 
 
Sigma non-opioid intracellular receptor 1
Name:Sigma non-opioid intracellular receptor 1
Type:Protein
Mol. Mass.:25307.17
Organism:Cavia porcellus (Guinea pig)
Description:Q60492
Residue:223
BDBM50034186
NameBDBM50034186
Synonyms:CHEMBL3359219
TypeSmall organic molecule
Emp. Form.C19H24FN3O
Mol. Mass.329.4118
SMILESCc1nc(nc(OCCCN2CCCCC2)c1F)-c1ccccc1