Reaction Details
TargetKappa-type opioid receptor
LigandBDBM50034542
Substrate/Competitorn/a
Meas. Tech.ChEMBL_1438728 (CHEMBL3388550)
EC50 0.410000±n/a nM
Citation Riley, APGroer, CEYoung, DEwald, AWKivell, BMPrisinzano, TE Synthesis and¿-opioid receptor activity of furan-substituted salvinorin A analogues. J Med Chem57:10464-75 (2014) 
 
Kappa-type opioid receptor
Name:Kappa-type opioid receptor
Type:G Protein-Coupled Receptor (GPCR)
Mol. Mass.:42648.76
Organism:Homo sapiens (Human)
Description:P41145
Residue:380
BDBM50034542
NameBDBM50034542
Synonyms:CHEMBL3359794
TypeSmall organic molecule
Emp. Form.C24H30O8
Mol. Mass.446.4902
SMILES[H][C@@]12CC[C@@]3(C)[C@@H](C[C@H](OC(C)=O)C(=O)[C@]3([H])[C@@]1(C)C[C@H](OC2=O)c1ccoc1C)C(=O)OC