Reaction Details
TargetKappa-type opioid receptor
LigandBDBM50216132
Substrate/Competitorn/a
Meas. Tech.ChEMBL_1438728 (CHEMBL3388550)
EC50 0.040000±n/a nM
Citation Riley, APGroer, CEYoung, DEwald, AWKivell, BMPrisinzano, TE Synthesis and¿-opioid receptor activity of furan-substituted salvinorin A analogues. J Med Chem57:10464-75 (2014) 
 
Kappa-type opioid receptor
Name:Kappa-type opioid receptor
Type:G Protein-Coupled Receptor (GPCR)
Mol. Mass.:42648.76
Organism:Homo sapiens (Human)
Description:P41145
Residue:380
BDBM50216132
NameBDBM50216132
Synonyms:(2S,4aR,6aR,7R,9S,10aS,10bR)-methyl 9-acetoxy-2-(2-bromofuran-3-yl)-6a,10b-dimethyl-4,10-dioxo-dodecahydro-1H-benzo[f]isochromene-7-carboxylate CHEMBL390935
TypeSmall organic molecule
Emp. Form.C23H27BrO8
Mol. Mass.511.36
SMILESCOC(=O)[C@@H]1C[C@H](OC(C)=O)C(=O)[C@H]2[C@@]1(C)CC[C@H]1C(=O)O[C@@H](C[C@]21C)c1ccoc1Br