Reaction Details
TargetKappa-type opioid receptor
LigandBDBM50099650
Substrate/Competitorn/a
Meas. Tech.ChEMBL_1438728 (CHEMBL3388550)
EC50 620±n/a nM
Citation Riley, APGroer, CEYoung, DEwald, AWKivell, BMPrisinzano, TE Synthesis and¿-opioid receptor activity of furan-substituted salvinorin A analogues. J Med Chem57:10464-75 (2014) 
 
Kappa-type opioid receptor
Name:Kappa-type opioid receptor
Type:G Protein-Coupled Receptor (GPCR)
Mol. Mass.:42648.76
Organism:Homo sapiens (Human)
Description:P41145
Residue:380
BDBM50099650
NameBDBM50099650
Synonyms:CHEMBL3359808
TypeSmall organic molecule
Emp. Form.C29H33NO8
Mol. Mass.523.5742
SMILES[H][C@@]12CC[C@@]3(C)[C@@H](C[C@H](OC(C)=O)C(=O)[C@]3([H])[C@@]1(C)C[C@H](OC2=O)c1ccoc1-c1ccc(N)cc1)C(=O)OC