Reaction Details
Target4-galactosyl-N-acetylglucosaminide 3-alpha-L-fucosyltransferase 9
LigandBDBM92459
Substrate/Competitorn/a
Meas. Tech.ChEMBL_1432745 (CHEMBL3390549)
IC50 59000±n/a nM
Citation Seelhorst, KPiernitzki, TLunau, NMeier, CHahn, U Synthesis and analysis of potentiala1,3-fucosyltransferase inhibitors. Bioorg Med Chem22:6430-7 (2014) 
 
4-galactosyl-N-acetylglucosaminide 3-alpha-L-fucosyltransferase 9
Name:4-galactosyl-N-acetylglucosaminide 3-alpha-L-fucosyltransferase 9
Type:PROTEIN
Mol. Mass.:42078.14
Organism:Homo sapiens (Human)
Description:ChEMBL_10775
Residue:359
BDBM92459
NameBDBM92459
Synonyms:CHEMBL384759 Guanosine Diphosphate
TypeSmall molecule
Emp. Form.C10H15N5O11P2
Mol. Mass.443.2005
SMILESNc1nc2n(cnc2c(=O)[nH]1)[C@@H]1O[C@H](COP(O)(=O)OP(O)(O)=O)[C@@H](O)[C@H]1O