Reaction Details
TargetCarbonic anhydrase 12
LigandBDBM50035677
Substrate/Competitorn/a
Meas. Tech.ChEMBL_1434388 (CHEMBL3387075)
Ki 91±n/a nM
Citation Abdel-Aziz, AAEl-Azab, ASCeruso, MSupuran, CT Carbonic anhydrase inhibitory activity of sulfonamides and carboxylic acids incorporating cyclic imide scaffolds. Bioorg Med Chem Lett24:5185-9 (2014) 
 
Carbonic anhydrase 12
Name:Carbonic anhydrase 12
Type:Enzyme
Mol. Mass.:39456.00
Organism:Homo sapiens (Human)
Description:Catalytic domain of human cloned isozyme was used in the assay
Residue:354
BDBM50035677
NameBDBM50035677
Synonyms:CHEMBL2377773
TypeSmall organic molecule
Emp. Form.C14H9N3O6S
Mol. Mass.347.303
SMILESNS(=O)(=O)c1ccc(cc1)N1C(=O)c2ccc(cc2C1=O)[N+]([O-])=O