Reaction Details
TargetCarbonic anhydrase 1
LigandBDBM50035688
Substrate/Competitorn/a
Meas. Tech.ChEMBL_1434385 (CHEMBL3387072)
Ki 176±n/a nM
Citation Abdel-Aziz, AAEl-Azab, ASCeruso, MSupuran, CT Carbonic anhydrase inhibitory activity of sulfonamides and carboxylic acids incorporating cyclic imide scaffolds. Bioorg Med Chem Lett24:5185-9 (2014) 
 
Carbonic anhydrase 1
Name:Carbonic anhydrase 1
Type:Enzyme
Mol. Mass.:28873.37
Organism:Homo sapiens (Human)
Description:P00915
Residue:261
BDBM50035688
NameBDBM50035688
Synonyms:CHEMBL2377780
TypeSmall organic molecule
Emp. Form.C11H12N2O4S
Mol. Mass.268.289
SMILESNS(=O)(=O)c1ccc(CN2C(=O)CCC2=O)cc1