Reaction Details
TargetCarbonic anhydrase 1
LigandBDBM50035695
Substrate/Competitorn/a
Meas. Tech.ChEMBL_1434385 (CHEMBL3387072)
Ki>1000±n/a nM
Citation Abdel-Aziz, AAEl-Azab, ASCeruso, MSupuran, CT Carbonic anhydrase inhibitory activity of sulfonamides and carboxylic acids incorporating cyclic imide scaffolds. Bioorg Med Chem Lett24:5185-9 (2014) 
 
Carbonic anhydrase 1
Name:Carbonic anhydrase 1
Type:Enzyme
Mol. Mass.:28873.37
Organism:Homo sapiens (Human)
Description:P00915
Residue:261
BDBM50035695
NameBDBM50035695
Synonyms:CHEMBL2377777
TypeSmall organic molecule
Emp. Form.C13H7N3O4
Mol. Mass.269.2124
SMILESOC(=O)c1ccc(cc1)N1C(=O)c2nccnc2C1=O