Reaction Details
TargetCarbonic anhydrase 2
LigandBDBM50035688
Substrate/Competitorn/a
Meas. Tech.ChEMBL_1434386 (CHEMBL3387073)
Ki 28±n/a nM
Citation Abdel-Aziz, AAEl-Azab, ASCeruso, MSupuran, CT Carbonic anhydrase inhibitory activity of sulfonamides and carboxylic acids incorporating cyclic imide scaffolds. Bioorg Med Chem Lett24:5185-9 (2014) 
 
Carbonic anhydrase 2
Name:Carbonic anhydrase 2
Type:Enzyme
Mol. Mass.:29250.71
Organism:Homo sapiens (Human)
Description:P00918
Residue:260
BDBM50035688
NameBDBM50035688
Synonyms:CHEMBL2377780
TypeSmall organic molecule
Emp. Form.C11H12N2O4S
Mol. Mass.268.289
SMILESNS(=O)(=O)c1ccc(CN2C(=O)CCC2=O)cc1