Reaction Details
TargetCarbonic anhydrase 2
LigandBDBM50035691
Substrate/Competitorn/a
Meas. Tech.ChEMBL_1434386 (CHEMBL3387073)
Ki 6.2±n/a nM
Citation Abdel-Aziz, AAEl-Azab, ASCeruso, MSupuran, CT Carbonic anhydrase inhibitory activity of sulfonamides and carboxylic acids incorporating cyclic imide scaffolds. Bioorg Med Chem Lett24:5185-9 (2014) 
 
Carbonic anhydrase 2
Name:Carbonic anhydrase 2
Type:Enzyme
Mol. Mass.:29250.71
Organism:Homo sapiens (Human)
Description:P00918
Residue:260
BDBM50035691
NameBDBM50035691
Synonyms:CHEMBL2377790
TypeSmall organic molecule
Emp. Form.C19H20N2O4S
Mol. Mass.372.438
SMILESCC(C)(C)c1ccc2C(=O)N(Cc3ccc(cc3)S(N)(=O)=O)C(=O)c2c1