Reaction Details
TargetCarbonic anhydrase 12
LigandBDBM50035698
Substrate/Competitorn/a
Meas. Tech.ChEMBL_1434388 (CHEMBL3387075)
Ki 1.000000±n/a nM
Citation Abdel-Aziz, AAEl-Azab, ASCeruso, MSupuran, CT Carbonic anhydrase inhibitory activity of sulfonamides and carboxylic acids incorporating cyclic imide scaffolds. Bioorg Med Chem Lett24:5185-9 (2014) 
 
Carbonic anhydrase 12
Name:Carbonic anhydrase 12
Type:Enzyme
Mol. Mass.:39456.00
Organism:Homo sapiens (Human)
Description:Catalytic domain of human cloned isozyme was used in the assay
Residue:354
BDBM50035698
NameBDBM50035698
Synonyms:CHEMBL2377779
TypeSmall organic molecule
Emp. Form.C18H12N2O4S
Mol. Mass.352.364
SMILESNS(=O)(=O)c1ccc(cc1)N1C(=O)c2cccc3cccc(C1=O)c23