Reaction Details
TargetCarbonic anhydrase 9
LigandBDBM50035690
Substrate/Competitorn/a
Meas. Tech.ChEMBL_1434387 (CHEMBL3387074)
Ki 350±n/a nM
Citation Abdel-Aziz, AAEl-Azab, ASCeruso, MSupuran, CT Carbonic anhydrase inhibitory activity of sulfonamides and carboxylic acids incorporating cyclic imide scaffolds. Bioorg Med Chem Lett24:5185-9 (2014) 
 
Carbonic anhydrase 9
Name:Carbonic anhydrase 9
Type:Enzyme
Mol. Mass.:49669.03
Organism:Homo sapiens (Human)
Description:Catalytic domain of human cloned isozyme was used in the assay
Residue:459
BDBM50035690
NameBDBM50035690
Synonyms:CHEMBL2377789
TypeSmall organic molecule
Emp. Form.C16H11NO4
Mol. Mass.281.2628
SMILESCc1ccc2C(=O)N(C(=O)c2c1)c1ccc(cc1)C(O)=O