Reaction Details
TargetCarbonic anhydrase 9
LigandBDBM50035679
Substrate/Competitorn/a
Meas. Tech.ChEMBL_1434387 (CHEMBL3387074)
Ki 5.9±n/a nM
Citation Abdel-Aziz, AAEl-Azab, ASCeruso, MSupuran, CT Carbonic anhydrase inhibitory activity of sulfonamides and carboxylic acids incorporating cyclic imide scaffolds. Bioorg Med Chem Lett24:5185-9 (2014) 
 
Carbonic anhydrase 9
Name:Carbonic anhydrase 9
Type:Enzyme
Mol. Mass.:49669.03
Organism:Homo sapiens (Human)
Description:Catalytic domain of human cloned isozyme was used in the assay
Residue:459
BDBM50035679
NameBDBM50035679
Synonyms:CHEMBL2377775
TypeSmall organic molecule
Emp. Form.C13H10N4O4S
Mol. Mass.318.308
SMILESNS(=O)(=O)c1ccc(CN2C(=O)c3nccnc3C2=O)cc1