Reaction Details
TargetCarbonic anhydrase 12
LigandBDBM50035688
Substrate/Competitorn/a
Meas. Tech.ChEMBL_1434388 (CHEMBL3387075)
Ki 0.680000±n/a nM
Citation Abdel-Aziz, AAEl-Azab, ASCeruso, MSupuran, CT Carbonic anhydrase inhibitory activity of sulfonamides and carboxylic acids incorporating cyclic imide scaffolds. Bioorg Med Chem Lett24:5185-9 (2014) 
 
Carbonic anhydrase 12
Name:Carbonic anhydrase 12
Type:Enzyme
Mol. Mass.:39456.00
Organism:Homo sapiens (Human)
Description:Catalytic domain of human cloned isozyme was used in the assay
Residue:354
BDBM50035688
NameBDBM50035688
Synonyms:CHEMBL2377780
TypeSmall organic molecule
Emp. Form.C11H12N2O4S
Mol. Mass.268.289
SMILESNS(=O)(=O)c1ccc(CN2C(=O)CCC2=O)cc1