Reaction Details
TargetCarbonic anhydrase 12
LigandBDBM50035685
Substrate/Competitorn/a
Meas. Tech.ChEMBL_1434388 (CHEMBL3387075)
Ki 0.600000±n/a nM
Citation Abdel-Aziz, AAEl-Azab, ASCeruso, MSupuran, CT Carbonic anhydrase inhibitory activity of sulfonamides and carboxylic acids incorporating cyclic imide scaffolds. Bioorg Med Chem Lett24:5185-9 (2014) 
 
Carbonic anhydrase 12
Name:Carbonic anhydrase 12
Type:Enzyme
Mol. Mass.:39456.00
Organism:Homo sapiens (Human)
Description:Catalytic domain of human cloned isozyme was used in the assay
Residue:354
BDBM50035685
NameBDBM50035685
Synonyms:CHEMBL2377783
TypeSmall organic molecule
Emp. Form.C15H16N2O4S
Mol. Mass.320.364
SMILES[H][C@@]12CC=CC[C@]1([H])C(=O)N(Cc1ccc(cc1)S(N)(=O)=O)C2=O