Reaction Details
TargetProstaglandin G/H synthase 2
LigandBDBM50035971
Substrate/Competitorn/a
Meas. Tech.ChEMBL_1436537 (CHEMBL3382316)
IC50 6330±n/a nM
Citation Alegaon, SGHirpara, MBAlagawadi, KRHullatti, KKKashniyal, K Synthesis of novel pyrazole?thiadiazole hybrid as potential potent and selective cyclooxygenase-2 (COX-2) inhibitors. Bioorg Med Chem Lett24:5324-9 (2015) 
 
Prostaglandin G/H synthase 2
Name:Prostaglandin G/H synthase 2
Type:Protein
Mol. Mass.:68976.98
Organism:Ovis aries (Sheep)
Description:n/a
Residue:603
BDBM50035971
NameBDBM50035971
Synonyms:CHEMBL3338718
TypeSmall organic molecule
Emp. Form.C17H14BrN5S
Mol. Mass.400.296
SMILESNC(=S)N\N=C/c1cn(nc1-c1ccc(Br)cc1)-c1ccccc1