Reaction Details
TargetProstaglandin G/H synthase 2
LigandBDBM50035937
Substrate/Competitorn/a
Meas. Tech.ChEMBL_1436537 (CHEMBL3382316)
IC50 3330±n/a nM
Citation Alegaon, SGHirpara, MBAlagawadi, KRHullatti, KKKashniyal, K Synthesis of novel pyrazole?thiadiazole hybrid as potential potent and selective cyclooxygenase-2 (COX-2) inhibitors. Bioorg Med Chem Lett24:5324-9 (2015) 
 
Prostaglandin G/H synthase 2
Name:Prostaglandin G/H synthase 2
Type:Protein
Mol. Mass.:68976.98
Organism:Ovis aries (Sheep)
Description:n/a
Residue:603
BDBM50035937
NameBDBM50035937
Synonyms:CHEMBL3338734
TypeSmall organic molecule
Emp. Form.C28H25N5O3S
Mol. Mass.511.595
SMILESCOc1ccc(cc1)-c1nn(cc1C1SC(=NN1C(C)=O)N(C(C)=O)c1ccccc1)-c1ccccc1