Reaction Details
TargetProstaglandin G/H synthase 1
LigandBDBM50035979
Substrate/Competitorn/a
Meas. Tech.ChEMBL_1436536 (CHEMBL3382315)
IC50 56330±n/a nM
Citation Alegaon, SGHirpara, MBAlagawadi, KRHullatti, KKKashniyal, K Synthesis of novel pyrazole?thiadiazole hybrid as potential potent and selective cyclooxygenase-2 (COX-2) inhibitors. Bioorg Med Chem Lett24:5324-9 (2015) 
 
Prostaglandin G/H synthase 1
Name:Prostaglandin G/H synthase 1
Type:Protein
Mol. Mass.:68868.60
Organism:Ovis aries (Sheep)
Description:n/a
Residue:600
BDBM50035979
NameBDBM50035979
Synonyms:CHEMBL3338717
TypeSmall organic molecule
Emp. Form.C17H14ClN5S
Mol. Mass.355.845
SMILESNC(=S)N\N=C/c1cn(nc1-c1ccc(Cl)cc1)-c1ccccc1