Reaction Details
TargetProstaglandin G/H synthase 2
LigandBDBM50035988
Substrate/Competitorn/a
Meas. Tech.ChEMBL_1436537 (CHEMBL3382316)
IC50 12660±n/a nM
Citation Alegaon, SGHirpara, MBAlagawadi, KRHullatti, KKKashniyal, K Synthesis of novel pyrazole?thiadiazole hybrid as potential potent and selective cyclooxygenase-2 (COX-2) inhibitors. Bioorg Med Chem Lett24:5324-9 (2015) 
 
Prostaglandin G/H synthase 2
Name:Prostaglandin G/H synthase 2
Type:Protein
Mol. Mass.:68976.98
Organism:Ovis aries (Sheep)
Description:n/a
Residue:603
BDBM50035988
NameBDBM50035988
Synonyms:CHEMBL3338728
TypeSmall organic molecule
Emp. Form.C26H21N5O2S
Mol. Mass.467.542
SMILESCOc1ccc(cc1)-c1nn(cc1\C=N/N=C1/SCC(=O)N1c1ccccc1)-c1ccccc1