Reaction Details
TargetProstaglandin G/H synthase 1
LigandBDBM50035935
Substrate/Competitorn/a
Meas. Tech.ChEMBL_1436536 (CHEMBL3382315)
IC50 66330±n/a nM
Citation Alegaon, SGHirpara, MBAlagawadi, KRHullatti, KKKashniyal, K Synthesis of novel pyrazole?thiadiazole hybrid as potential potent and selective cyclooxygenase-2 (COX-2) inhibitors. Bioorg Med Chem Lett24:5324-9 (2015) 
 
Prostaglandin G/H synthase 1
Name:Prostaglandin G/H synthase 1
Type:Protein
Mol. Mass.:68868.60
Organism:Ovis aries (Sheep)
Description:n/a
Residue:600
BDBM50035935
NameBDBM50035935
Synonyms:CHEMBL3338724
TypeSmall organic molecule
Emp. Form.C19H14BrN5OS
Mol. Mass.440.316
SMILESBrc1ccc(cc1)-c1nn(cc1\C=N/NC1=NC(=O)CS1)-c1ccccc1