Reaction Details
TargetProstaglandin G/H synthase 1
LigandBDBM50035975
Substrate/Competitorn/a
Meas. Tech.ChEMBL_1436536 (CHEMBL3382315)
IC50 70330±n/a nM
Citation Alegaon, SGHirpara, MBAlagawadi, KRHullatti, KKKashniyal, K Synthesis of novel pyrazole?thiadiazole hybrid as potential potent and selective cyclooxygenase-2 (COX-2) inhibitors. Bioorg Med Chem Lett24:5324-9 (2015) 
 
Prostaglandin G/H synthase 1
Name:Prostaglandin G/H synthase 1
Type:Protein
Mol. Mass.:68868.60
Organism:Ovis aries (Sheep)
Description:n/a
Residue:600
BDBM50035975
NameBDBM50035975
Synonyms:CHEMBL3338729
TypeSmall organic molecule
Emp. Form.C21H18ClN5O2S
Mol. Mass.439.918
SMILESCC(=O)NC1=NN(C(S1)c1cn(nc1-c1ccc(Cl)cc1)-c1ccccc1)C(C)=O