Reaction Details
TargetProstaglandin G/H synthase 2
LigandBDBM11639
Substrate/Competitorn/a
Meas. Tech.ChEMBL_1436537 (CHEMBL3382316)
IC50 300±n/a nM
Citation Alegaon, SGHirpara, MBAlagawadi, KRHullatti, KKKashniyal, K Synthesis of novel pyrazole?thiadiazole hybrid as potential potent and selective cyclooxygenase-2 (COX-2) inhibitors. Bioorg Med Chem Lett24:5324-9 (2015) 
 
Prostaglandin G/H synthase 2
Name:Prostaglandin G/H synthase 2
Type:Protein
Mol. Mass.:68976.98
Organism:Ovis aries (Sheep)
Description:n/a
Residue:603
BDBM11639
NameBDBM11639
Synonyms:4-[5-(4-methylphenyl)-3-(trifluoromethyl)-1H-pyrazol-1-yl]benzene-1-sulfonamide CLX Celecoxib US11478464, Compound Celecoxib US8741944, Comparative Compound cid_2662
TypeSmall organic molecule
Emp. Form.C17H14F3N3O2S
Mol. Mass.381.372
SMILESCc1ccc(cc1)-c1cc(nn1-c1ccc(cc1)S(N)(=O)=O)C(F)(F)F