Reaction Details
TargetProstaglandin G/H synthase 1
LigandBDBM50035943
Substrate/Competitorn/a
Meas. Tech.ChEMBL_1436536 (CHEMBL3382315)
IC50 80330±n/a nM
Citation Alegaon, SGHirpara, MBAlagawadi, KRHullatti, KKKashniyal, K Synthesis of novel pyrazole?thiadiazole hybrid as potential potent and selective cyclooxygenase-2 (COX-2) inhibitors. Bioorg Med Chem Lett24:5324-9 (2015) 
 
Prostaglandin G/H synthase 1
Name:Prostaglandin G/H synthase 1
Type:Protein
Mol. Mass.:68868.60
Organism:Ovis aries (Sheep)
Description:n/a
Residue:600
BDBM50035943
NameBDBM50035943
Synonyms:CHEMBL3338731
TypeSmall organic molecule
Emp. Form.C22H21N5O3S
Mol. Mass.435.499
SMILESCOc1ccc(cc1)-c1nn(cc1C1SC(NC(C)=O)=NN1C(C)=O)-c1ccccc1