Reaction Details
TargetProstaglandin G/H synthase 1
LigandBDBM50035934
Substrate/Competitorn/a
Meas. Tech.ChEMBL_1436536 (CHEMBL3382315)
IC50 60500±n/a nM
Citation Alegaon, SGHirpara, MBAlagawadi, KRHullatti, KKKashniyal, K Synthesis of novel pyrazole?thiadiazole hybrid as potential potent and selective cyclooxygenase-2 (COX-2) inhibitors. Bioorg Med Chem Lett24:5324-9 (2015) 
 
Prostaglandin G/H synthase 1
Name:Prostaglandin G/H synthase 1
Type:Protein
Mol. Mass.:68868.60
Organism:Ovis aries (Sheep)
Description:n/a
Residue:600
BDBM50035934
NameBDBM50035934
Synonyms:CHEMBL3338727
TypeSmall organic molecule
Emp. Form.C25H18BrN5OS
Mol. Mass.516.412
SMILESBrc1ccc(cc1)-c1nn(cc1\C=N/N=C1/SCC(=O)N1c1ccccc1)-c1ccccc1