Reaction Details
TargetEquilibrative nucleoside transporter 1
LigandBDBM50036311
Substrate/Competitorn/a
Meas. Tech.ChEMBL_1432010 (CHEMBL3388115)
IC50 4.6±n/a nM
Citation Playa, HLewis, TATing, ASuh, BCMuņoz, BMatuza, RPasser, BJSchreiber, SLBuolamwini, JK Dilazep analogues for the study of equilibrative nucleoside transporters 1 and 2 (ENT1 and ENT2). Bioorg Med Chem Lett24:5801-4 (2014) 
 
Equilibrative nucleoside transporter 1
Name:Equilibrative nucleoside transporter 1
Type:Multi-pass membrane protein
Mol. Mass.:50225.92
Organism:Homo sapiens (Human)
Description:n/a
Residue:456
BDBM50036311
NameBDBM50036311
Synonyms:CHEMBL3353074
TypeSmall organic molecule
Emp. Form.C30H42N2O10
Mol. Mass.590.6619
SMILESCOc1cc(cc(OC)c1OC)C(=O)OCCCN1CCCN(CCOC(=O)c2cc(OC)c(OC)c(OC)c2)CC1