Reaction Details
TargetEquilibrative nucleoside transporter 2
LigandBDBM50017691
Substrate/Competitorn/a
Meas. Tech.ChEMBL_1432011 (CHEMBL3388116)
IC50 8800±n/a nM
Citation Playa, HLewis, TATing, ASuh, BCMuņoz, BMatuza, RPasser, BJSchreiber, SLBuolamwini, JK Dilazep analogues for the study of equilibrative nucleoside transporters 1 and 2 (ENT1 and ENT2). Bioorg Med Chem Lett24:5801-4 (2014) 
 
Equilibrative nucleoside transporter 2
Name:Equilibrative nucleoside transporter 2
Type:PROTEIN
Mol. Mass.:50265.69
Organism:Rattus norvegicus
Description:ChEMBL_103616
Residue:456
BDBM50017691
NameBDBM50017691
Synonyms:CHEMBL126075 | dilazep
TypeSmall organic molecule
Emp. Form.C31H44N2O10
Mol. Mass.604.6885
SMILESCOc1cc(cc(OC)c1OC)C(=O)OCCCN1CCCN(CCCOC(=O)c2cc(OC)c(OC)c(OC)c2)CC1