Reaction Details
TargetEquilibrative nucleoside transporter 2
LigandBDBM50036309
Substrate/Competitorn/a
Meas. Tech.ChEMBL_1432011 (CHEMBL3388116)
IC50 1490±n/a nM
Citation Playa, HLewis, TATing, ASuh, BCMuņoz, BMatuza, RPasser, BJSchreiber, SLBuolamwini, JK Dilazep analogues for the study of equilibrative nucleoside transporters 1 and 2 (ENT1 and ENT2). Bioorg Med Chem Lett24:5801-4 (2014) 
 
Equilibrative nucleoside transporter 2
Name:Equilibrative nucleoside transporter 2
Type:PROTEIN
Mol. Mass.:50265.69
Organism:Rattus norvegicus
Description:ChEMBL_103616
Residue:456
BDBM50036309
NameBDBM50036309
Synonyms:CHEMBL3353072
TypeSmall organic molecule
Emp. Form.C34H50N2O10
Mol. Mass.646.7682
SMILESCOc1cc(cc(OC)c1OC)C(=O)OCCCCN1CC(C)N(CCCCOC(=O)c2cc(OC)c(OC)c(OC)c2)CC1C