Reaction Details
TargetHistone deacetylase 2
LigandBDBM50005711
Substrate/Competitorn/a
Meas. Tech.ChEMBL_1434457 (CHEMBL3388274)
IC50 28±n/a nM
Citation Zwick, VChatzivasileiou, AODeschamps, NRoussaki, MSimões-Pires, CANurisso, ADenis, IBlanquart, CMartinet, NCarrupt, PADetsi, ACuendet, M Aurones as histone deacetylase inhibitors: identification of key features. Bioorg Med Chem Lett24:5497-501 (2015) 
 
Histone deacetylase 2
Name:Histone deacetylase 2
Type:Chromatin regulator; hydrolase; repressor
Mol. Mass.:55356.54
Organism:Homo sapiens (Human)
Description:Q92769
Residue:488
BDBM50005711
NameBDBM50005711
Synonyms:CHEBI:46024 TRICHOSTATIN Trichostatin A (TSA) US10722597, Compound Trichostatin US20230322747, Compound trichostatin A | US9265734, TSA
TypeSmall organic molecule
Emp. Form.C17H22N2O3
Mol. Mass.302.3682
SMILESC[C@H](\C=C(/C)\C=C\C(=O)NO)C(=O)c1ccc(cc1)N(C)C