Reaction Details
TargetCarbonic anhydrase 1
LigandBDBM50037230
Substrate/Competitorn/a
Meas. Tech.ChEMBL_1436581 (CHEMBL3382961)
Ki>50000±n/a nM
Citation SitaRam, naCeruso, MKhloya, PSupuran, CTSharma, PK 4-Functionalized 1,3-diarylpyrazoles bearing 6-aminosulfonylbenzothiazole moiety as potent inhibitors of carbonic anhydrase isoforms hCA I, II, IX and XII. Bioorg Med Chem22:6945-52 (2014) 
 
Carbonic anhydrase 1
Name:Carbonic anhydrase 1
Type:Enzyme
Mol. Mass.:28873.37
Organism:Homo sapiens (Human)
Description:P00915
Residue:261
BDBM50037230
NameBDBM50037230
Synonyms:CHEMBL3356269
TypeSmall organic molecule
Emp. Form.C18H13N5O2S2
Mol. Mass.395.458
SMILESCc1ccc(cc1)-c1nn(cc1C#N)-c1nc2ccc(cc2s1)S(N)(=O)=O