Reaction Details
TargetCarbonic anhydrase 2
LigandBDBM50037244
Substrate/Competitorn/a
Meas. Tech.ChEMBL_1436582 (CHEMBL3382962)
Ki 3.8±n/a nM
Citation SitaRam, naCeruso, MKhloya, PSupuran, CTSharma, PK 4-Functionalized 1,3-diarylpyrazoles bearing 6-aminosulfonylbenzothiazole moiety as potent inhibitors of carbonic anhydrase isoforms hCA I, II, IX and XII. Bioorg Med Chem22:6945-52 (2014) 
 
Carbonic anhydrase 2
Name:Carbonic anhydrase 2
Type:Enzyme
Mol. Mass.:29250.71
Organism:Homo sapiens (Human)
Description:P00918
Residue:260
BDBM50037244
NameBDBM50037244
Synonyms:CHEMBL3356262
TypeSmall organic molecule
Emp. Form.C17H11N5O5S2
Mol. Mass.429.43
SMILESNS(=O)(=O)c1ccc2nc(sc2c1)-n1cc(C=O)c(n1)-c1ccc(cc1)[N+]([O-])=O