Reaction Details
TargetCarbonic anhydrase 12
LigandBDBM50037217
Substrate/Competitorn/a
Meas. Tech.ChEMBL_1436584 (CHEMBL3382964)
Ki 50±n/a nM
Citation SitaRam, naCeruso, MKhloya, PSupuran, CTSharma, PK 4-Functionalized 1,3-diarylpyrazoles bearing 6-aminosulfonylbenzothiazole moiety as potent inhibitors of carbonic anhydrase isoforms hCA I, II, IX and XII. Bioorg Med Chem22:6945-52 (2014) 
 
Carbonic anhydrase 12
Name:Carbonic anhydrase 12
Type:Enzyme
Mol. Mass.:39456.00
Organism:Homo sapiens (Human)
Description:Catalytic domain of human cloned isozyme was used in the assay
Residue:354
BDBM50037217
NameBDBM50037217
Synonyms:CHEMBL3356276
TypeSmall organic molecule
Emp. Form.C18H15N5O4S2
Mol. Mass.429.473
SMILESCOc1ccc(cc1)-c1nn(cc1\C=N\O)-c1nc2ccc(cc2s1)S(N)(=O)=O