Reaction Details
TargetCarbonic anhydrase 12
LigandBDBM50037246
Substrate/Competitorn/a
Meas. Tech.ChEMBL_1436584 (CHEMBL3382964)
Ki 40±n/a nM
Citation SitaRam, naCeruso, MKhloya, PSupuran, CTSharma, PK 4-Functionalized 1,3-diarylpyrazoles bearing 6-aminosulfonylbenzothiazole moiety as potent inhibitors of carbonic anhydrase isoforms hCA I, II, IX and XII. Bioorg Med Chem22:6945-52 (2014) 
 
Carbonic anhydrase 12
Name:Carbonic anhydrase 12
Type:Enzyme
Mol. Mass.:39456.00
Organism:Homo sapiens (Human)
Description:Catalytic domain of human cloned isozyme was used in the assay
Residue:354
BDBM50037246
NameBDBM50037246
Synonyms:CHEMBL3356261
TypeSmall organic molecule
Emp. Form.C17H11ClN4O3S2
Mol. Mass.418.877
SMILESNS(=O)(=O)c1ccc2nc(sc2c1)-n1cc(C=O)c(n1)-c1ccc(Cl)cc1